Build: #913 failed Changes by Frank Lützenkirchen

Build result summary

Details

Completed
Duration
34 seconds
Labels
None
Agent
Default Agent
Revision
37545 37545
No failed test found. A possible compilation error occurred.

Responsible

No one has taken responsibility for this failure

Code commits

Author Commit Message Commit date
Frank Lützenkirchen Frank Lützenkirchen 37545 37545 Ignore corrupt alias path that does not match the parent alias

Error summary for Build and test

The job generated some errors, drill down into the full build log for more details.

Could not find test result reports in the /home/mycore/bamboo/bamboo-home/xml-data/build-dir/MILESS-BUILD-JOB1 directory.

BUILD FAILED
/home/mycore/bamboo/bamboo-home/xml-data/build-dir/MILESS-BUILD-JOB1/hudson.xml:60: The following error occurred while executing this line:
/home/mycore/bamboo/bamboo-home/xml-data/build-dir/MILESS-BUILD-JOB1/hudson.xml:372: Execute failed: java.io.IOException: Cannot run program "mvn": error=2, Datei oder Verzeichnis nicht gefunden
        at java.lang.ProcessBuilder.start(ProcessBuilder.java:1047)
        at java.lang.Runtime.exec(Runtime.java:617)
        at org.apache.tools.ant.taskdefs.launcher.Java13CommandLauncher.exec(Java13CommandLauncher.java:58)
        at org.apache.tools.ant.taskdefs.Execute.launch(Execute.java:428)
        at org.apache.tools.ant.taskdefs.Execute.execute(Execute.java:442)
        at org.apache.tools.ant.taskdefs.ExecTask.runExecute(ExecTask.java:629)
        at org.apache.tools.ant.taskdefs.ExecTask.runExec(ExecTask.java:670)
        at org.apache.tools.ant.taskdefs.ExecTask.execute(ExecTask.java:496)
        at org.apache.tools.ant.UnknownElement.execute(UnknownElement.java:293)
        at sun.reflect.GeneratedMethodAccessor4.invoke(Unknown Source)
        at sun.reflect.DelegatingMethodAccessorImpl.invoke(DelegatingMethodAccessorImpl.java:43)
        at java.lang.reflect.Method.invoke(Method.java:606)
        at org.apache.tools.ant.dispatch.DispatchUtils.execute(DispatchUtils.java:106)
        at org.apache.tools.ant.Task.perform(Task.java:348)
        at org.apache.tools.ant.Target.execute(Target.java:435)
        at org.apache.tools.ant.Target.performTasks(Target.java:456)
        at org.apache.tools.ant.Project.executeSortedTargets(Project.java:1405)
        at org.apache.tools.ant.helper.SingleCheckExecutor.executeTargets(SingleCheckExecutor.java:38)
        at org.apache.tools.ant.Project.executeTargets(Project.java:1260)
        at org.apache.tools.ant.taskdefs.Ant.execute(Ant.java:441)
        at org.apache.tools.ant.taskdefs.CallTarget.execute(CallTarget.java:105)
        at org.apache.tools.ant.UnknownElement.execute(UnknownElement.java:293)
        at sun.reflect.GeneratedMethodAccessor4.invoke(Unknown Source)
        at sun.reflect.DelegatingMethodAccessorImpl.invoke(DelegatingMethodAccessorImpl.java:43)
        at java.lang.reflect.Method.invoke(Method.java:606)
        at org.apache.tools.ant.dispatch.DispatchUtils.execute(DispatchUtils.java:106)
        at org.apache.tools.ant.Task.perform(Task.java:348)
        at org.apache.tools.ant.Target.execute(Target.java:435)
        at org.apache.tools.ant.Target.performTasks(Target.java:456)
        at org.apache.tools.ant.Project.executeSortedTargets(Project.java:1405)
        at org.apache.tools.ant.Project.executeTarget(Project.java:1376)
        at org.apache.tools.ant.helper.DefaultExecutor.executeTargets(DefaultExecutor.java:41)
        at org.apache.tools.ant.Project.executeTargets(Project.java:1260)
        at org.apache.tools.ant.Main.runBuild(Main.java:853)
        at org.apache.tools.ant.Main.startAnt(Main.java:235)
        at org.apache.tools.ant.launch.Launcher.run(Launcher.java:285)
        at org.apache.tools.ant.launch.Launcher.main(Launcher.java:112)
Caused by: java.io.IOException: error=2, Datei oder Verzeichnis nicht gefunden
        at java.lang.UNIXProcess.forkAndExec(Native Method)
        at java.lang.UNIXProcess.<init>(UNIXProcess.java:187)
        at java.lang.ProcessImpl.start(ProcessImpl.java:130)
        at java.lang.ProcessBuilder.start(ProcessBuilder.java:1028)
        ... 36 more

Total time: 0 seconds