Build #973

DocPortal is the deprecated sample application built upon MyCoRe. It is used widely as build tool for custom applications.

Build: #973 failed Child of MCR-BUILD-1377

Test results

  • 99 tests in total
  • 1 test failed
  • 2 tests were quarantined / skipped
  • 15 minutes taken in total.
Existing test failures 1
Status Test Failing since View job Duration
org.openqa.selenium.NoSuchElementException: Unable to locate element: {"method":"xpath","selector":".//a[contains(normalize-space(text()), 'Abmelden')]  | //a//*[normalize-space(text())=\"Abmelden\"]"}
Command duration or timeout: 10.11 seconds
For documentation on this error, please visit: http://seleniumhq.org/exceptions/no_such_element.html
Build info: version: '2.53.0', revision: '35ae25b1534ae328c771e0856c93e187490ca824', time: '2016-03-15 10:43:46'
System info: host: 'bamboo.mycore.de', ip: '141.35.20.254', os.name: 'Linux', os.arch: 'amd64', os.version: '2.6.32-696.el6.x86_64', java.version: '1.8.0_121'
Driver info: org.openqa.selenium.firefox.FirefoxDriver
Capabilities [{applicationCacheEnabled=true, rotatable=false, handlesAlerts=true, databaseEnabled=true, version=45.8.0, platform=LINUX, nativeEvents=false, acceptSslCerts=true, webStorageEnabled=true, locationContextEnabled=true, browserName=firefox, takesScreenshot=true, javascriptEnabled=true, cssSelectorsEnabled=true}]
Session ID: f60de499-251d-450e-a05a-763d5adbc23f
(22 more lines...)
Quarantined tests 2
Status Test Failing since Quarantined by View job Duration
Collapse Failed SearchComplexGuestIT rights_like History
Kathleen Neumann Kathleen Neumann
Integration Tests 34 secs
org.openqa.selenium.TimeoutException: Timed out after 30 seconds waiting for presence of any elements located by By.xpath: .//a[contains(normalize-space(text()), 'Die 99 582 am Lokschuppen in Schönheide.')]  | //a//*[normalize-space(text())="Die 99 582 am Lokschuppen in Schönheide."]
Build info: version: '2.53.0', revision: '35ae25b1534ae328c771e0856c93e187490ca824', time: '2016-03-15 10:43:46'
System info: host: 'bamboo.mycore.de', ip: '141.35.20.254', os.name: 'Linux', os.arch: 'amd64', os.version: '2.6.32-696.el6.x86_64', java.version: '1.8.0_121'
Driver info: org.openqa.selenium.firefox.FirefoxDriver
Capabilities [{applicationCacheEnabled=true, rotatable=false, handlesAlerts=true, databaseEnabled=true, version=45.8.0, platform=LINUX, nativeEvents=false, acceptSslCerts=true, webStorageEnabled=true, locationContextEnabled=true, browserName=firefox, takesScreenshot=true, javascriptEnabled=true, cssSelectorsEnabled=true}]
Session ID: fe9ee56f-d003-4a41-b7e1-a9555fab7df1
	at org.openqa.selenium.support.ui.WebDriverWait.timeoutException(WebDriverWait.java:80)
	at org.openqa.selenium.support.ui.FluentWait.until(FluentWait.java:261)
(3 more lines...)
Collapse Failed SearchIndexIT doc_s History
Kathleen Neumann Kathleen Neumann
Integration Tests 33 secs
org.openqa.selenium.TimeoutException: Timed out after 30 seconds waiting for presence of any elements located by By.xpath: //*[contains(normalize-space(text()),"Die 99 582 am Lokschuppen in Schönheide.")]
Build info: version: '2.53.0', revision: '35ae25b1534ae328c771e0856c93e187490ca824', time: '2016-03-15 10:43:46'
System info: host: 'bamboo.mycore.de', ip: '141.35.20.254', os.name: 'Linux', os.arch: 'amd64', os.version: '2.6.32-696.el6.x86_64', java.version: '1.8.0_121'
Driver info: org.openqa.selenium.firefox.FirefoxDriver
Capabilities [{applicationCacheEnabled=true, rotatable=false, handlesAlerts=true, databaseEnabled=true, version=45.8.0, platform=LINUX, nativeEvents=false, acceptSslCerts=true, webStorageEnabled=true, locationContextEnabled=true, browserName=firefox, takesScreenshot=true, javascriptEnabled=true, cssSelectorsEnabled=true}]
Session ID: 577eeecc-cfe9-4589-8a21-3320f19a4f52
	at org.openqa.selenium.support.ui.WebDriverWait.timeoutException(WebDriverWait.java:80)
	at org.openqa.selenium.support.ui.FluentWait.until(FluentWait.java:261)
(3 more lines...)